Reaction Details
TargetCarboxypeptidase B2
LigandBDBM50305346
Substrate/Competitorn/a
Meas. Tech.ChEMBL_603568 (CHEMBL1069123)
Ki 3.5±n/a nM
Citation Owen, DRBull, DJBunnage, MEGlossop, MSMaguire, RJStrang, RS Oxygenated analogues of UK-396082 as inhibitors of activated thrombin activatable fibrinolysis inhibitor. Bioorg Med Chem Lett20:92-6 (2010) 
 
Carboxypeptidase B2
Name:Carboxypeptidase B2
Type:Enzyme
Mol. Mass.:48432.74
Organism:Homo sapiens (Human)
Description:Q96IY4
Residue:423
BDBM50305346
NameBDBM50305346
Synonyms:(S)-2-(2-aminoethoxy)-3-(1-phenyl-1H-imidazol-4-yl)propanoic acid | CHEMBL589645
TypeSmall organic molecule
Emp. Form.C14H17N3O3
Mol. Mass.275.3031
SMILESNCCO[C@@H](Cc1cn(cn1)-c1ccccc1)C(O)=O