Reaction Details
TargetCarboxypeptidase B2
LigandBDBM50226606
Substrate/Competitorn/a
Meas. Tech.ChEMBL_603568 (CHEMBL1069123)
Ki 150±n/a nM
Citation Owen, DRBull, DJBunnage, MEGlossop, MSMaguire, RJStrang, RS Oxygenated analogues of UK-396082 as inhibitors of activated thrombin activatable fibrinolysis inhibitor. Bioorg Med Chem Lett20:92-6 (2010) 
 
Carboxypeptidase B2
Name:Carboxypeptidase B2
Type:Enzyme
Mol. Mass.:48432.74
Organism:Homo sapiens (Human)
Description:Q96IY4
Residue:423
BDBM50226606
NameBDBM50226606
Synonyms:(S)-2-(2-aminoethylamino)-3-(1-propyl-1H-imidazol-4-yl)propanoic acid | CHEMBL236547
TypeSmall organic molecule
Emp. Form.C11H20N4O2
Mol. Mass.240.3021
SMILESCCCn1cnc(C[C@H](NCCN)C(O)=O)c1