Reaction Details
TargetCarboxypeptidase B
LigandBDBM50226610
Substrate/Competitorn/a
Meas. Tech.ChEMBL_603569 (CHEMBL1069124)
Ki 206±n/a nM
Citation Owen, DRBull, DJBunnage, MEGlossop, MSMaguire, RJStrang, RS Oxygenated analogues of UK-396082 as inhibitors of activated thrombin activatable fibrinolysis inhibitor. Bioorg Med Chem Lett20:92-6 (2010) 
 
Carboxypeptidase B
Name:Carboxypeptidase B
Type:Enzyme
Mol. Mass.:47367.43
Organism:Homo sapiens (Human)
Description:P15086
Residue:417
BDBM50226610
NameBDBM50226610
Synonyms:(2S)-5-AMINO-2-[(1-PROPYL-1H-IMIDAZOL-4-YL)METHYL]PENTANOIC ACID (S)-5-amino-2-((1-propyl-1H-imidazol-4-yl)methyl)pentanoic acid | CHEMBL398110
TypeSmall organic molecule
Emp. Form.C12H21N3O2
Mol. Mass.239.314
SMILESCCCn1cnc(C[C@H](CCCN)C(O)=O)c1