Reaction Details
TargetCarboxypeptidase B
LigandBDBM50305348
Substrate/Competitorn/a
Meas. Tech.ChEMBL_603569 (CHEMBL1069124)
Ki 27±n/a nM
Citation Owen, DRBull, DJBunnage, MEGlossop, MSMaguire, RJStrang, RS Oxygenated analogues of UK-396082 as inhibitors of activated thrombin activatable fibrinolysis inhibitor. Bioorg Med Chem Lett20:92-6 (2010) 
 
Carboxypeptidase B
Name:Carboxypeptidase B
Type:Enzyme
Mol. Mass.:47367.43
Organism:Homo sapiens (Human)
Description:P15086
Residue:417
BDBM50305348
NameBDBM50305348
Synonyms:(S)-2-(2-aminoethoxy)-3-(1-(2-cyclohexylethyl)-1H-imidazol-4-yl)propanoic acid | CHEMBL594359
TypeSmall organic molecule
Emp. Form.C16H27N3O3
Mol. Mass.309.4039
SMILESNCCO[C@@H](Cc1cn(CCC2CCCCC2)cn1)C(O)=O