Reaction Details
TargetCarboxypeptidase B
LigandBDBM50305349
Substrate/Competitorn/a
Meas. Tech.ChEMBL_603569 (CHEMBL1069124)
Ki 360±n/a nM
Citation Owen, DRBull, DJBunnage, MEGlossop, MSMaguire, RJStrang, RS Oxygenated analogues of UK-396082 as inhibitors of activated thrombin activatable fibrinolysis inhibitor. Bioorg Med Chem Lett20:92-6 (2010) 
 
Carboxypeptidase B
Name:Carboxypeptidase B
Type:Enzyme
Mol. Mass.:47367.43
Organism:Homo sapiens (Human)
Description:P15086
Residue:417
BDBM50305349
NameBDBM50305349
Synonyms:(+/-)-2-(2-aminoethoxy)-3-(1-butyl-1H-imidazol-4-yl)propanoic acid | CHEMBL590859
TypeSmall organic molecule
Emp. Form.C12H21N3O3
Mol. Mass.255.3134
SMILESCCCCn1cnc(CC(OCCN)C(O)=O)c1