Reaction Details
TargetSphingosine 1-phosphate receptor 3
LigandBDBM50305386
Substrate/Competitorn/a
Meas. Tech.ChEMBL_603591 (CHEMBL1071143)
EC50>10000±n/a nM
Citation Zécri, FJAlbert, RLandrum, GHinterding, KCooke, NGGuerini, DStreiff, MBruns, CNuesslein-Hildesheim, B Pyrazole derived from (+)-3-carene; a novel potent, selective scaffold for sphingosine-1-phosphate (S1P(1)) receptor agonists. Bioorg Med Chem Lett20:35-7 (2010) 
 
Sphingosine 1-phosphate receptor 3
Name:Sphingosine 1-phosphate receptor 3
Type:G Protein-Coupled Receptor (GPCR)
Mol. Mass.:42278.13
Organism:Homo sapiens (Human)
Description:Q99500
Residue:378
BDBM50305386
NameBDBM50305386
Synonyms:1-((3bS,4aR)-3,4,4-Trimethyl-3b,4,4a,5-tetrahydro-cyclopropa[3,4]cyclopenta[1,2-c]pyrazol-1-yl)-heptan-1-one | CHEMBL596053
TypeSmall organic molecule
Emp. Form.C17H26N2O
Mol. Mass.274.4011
SMILESCCCCCCC(=O)n1nc(C)c2[C@H]3[C@@H](Cc12)C3(C)C