Reaction Details
TargetSphingosine 1-phosphate receptor 5
LigandBDBM50305384
Substrate/Competitorn/a
Meas. Tech.ChEMBL_603727 (CHEMBL1039350)
EC50>10000±n/a nM
Citation Zécri, FJAlbert, RLandrum, GHinterding, KCooke, NGGuerini, DStreiff, MBruns, CNuesslein-Hildesheim, B Pyrazole derived from (+)-3-carene; a novel potent, selective scaffold for sphingosine-1-phosphate (S1P(1)) receptor agonists. Bioorg Med Chem Lett20:35-7 (2010) 
 
Sphingosine 1-phosphate receptor 5
Name:Sphingosine 1-phosphate receptor 5
Type:G Protein-Coupled Receptor (GPCR)
Mol. Mass.:41796.42
Organism:Homo sapiens (Human)
Description:n/a
Residue:398
BDBM50305384
NameBDBM50305384
Synonyms:(3bS,4aR)-3,4,4-Trimethyl-1-[(2-phenyl)-ethenesulfonyl]-3b,4,4a,5-tetrahydro-1H-cyclopropa[3,4]cyclopenta[1,2-c]pyrazole | CHEMBL603441
TypeSmall organic molecule
Emp. Form.C18H20N2O2S
Mol. Mass.328.429
SMILESCc1nn(c2C[C@@H]3[C@H](c12)C3(C)C)S(=O)(=O)\C=C\c1ccccc1