Reaction Details
TargetCannabinoid receptor 1
LigandBDBM50305397
Substrate/Competitorn/a
Meas. Tech.ChEMBL_603745 (CHEMBL1039370)
IC50 1.2±n/a nM
Citation Cooper, MReceveur, JMBjurling, ENørregaard, PKNielsen, PASköld, NHögberg, T Exploring SAR features in diverse library of 4-cyanomethyl-pyrazole-3-carboxamides suitable for further elaborations as CB1 antagonists. Bioorg Med Chem Lett20:26-30 (2010) 
 
Cannabinoid receptor 1
Name:Cannabinoid receptor 1
Type:G Protein-Coupled Receptor (GPCR)
Mol. Mass.:52868.96
Organism:Homo sapiens (Human)
Description:P21554
Residue:472
BDBM50305397
NameBDBM50305397
Synonyms:CHEMBL589651 | N-(4-bromobenzyl)-1-(2-chlorophenyl)-5-(4-chlorophenyl)-4-(cyanomethyl)-1H-pyrazole-3-carboxamide
TypeSmall organic molecule
Emp. Form.C25H17BrCl2N4O
Mol. Mass.540.239
SMILESClc1ccc(cc1)-c1c(CC#N)c(nn1-c1ccccc1Cl)C(=O)NCc1ccc(Br)cc1