Reaction Details
TargetCannabinoid receptor 1
LigandBDBM50305413
Substrate/Competitorn/a
Meas. Tech.ChEMBL_603744 (CHEMBL1039369)
IC50 16±n/a nM
Citation Cooper, MReceveur, JMBjurling, ENørregaard, PKNielsen, PASköld, NHögberg, T Exploring SAR features in diverse library of 4-cyanomethyl-pyrazole-3-carboxamides suitable for further elaborations as CB1 antagonists. Bioorg Med Chem Lett20:26-30 (2010) 
 
Cannabinoid receptor 1
Name:Cannabinoid receptor 1
Type:G Protein-Coupled Receptor (GPCR)
Mol. Mass.:52868.96
Organism:Homo sapiens (Human)
Description:P21554
Residue:472
BDBM50305413
NameBDBM50305413
Synonyms:1-(2-chlorophenyl)-5-(4-chlorophenyl)-4-(cyanomethyl)-N-phenethyl-1H-pyrazole-3-carboxamide | CHEMBL592283
TypeSmall organic molecule
Emp. Form.C26H20Cl2N4O
Mol. Mass.475.369
SMILESClc1ccc(cc1)-c1c(CC#N)c(nn1-c1ccccc1Cl)C(=O)NCCc1ccccc1