Reaction Details
TargetCannabinoid receptor 1
LigandBDBM50305414
Substrate/Competitorn/a
Meas. Tech.ChEMBL_603744 (CHEMBL1039369)
IC50 15±n/a nM
Citation Cooper, MReceveur, JMBjurling, ENørregaard, PKNielsen, PASköld, NHögberg, T Exploring SAR features in diverse library of 4-cyanomethyl-pyrazole-3-carboxamides suitable for further elaborations as CB1 antagonists. Bioorg Med Chem Lett20:26-30 (2010) 
 
Cannabinoid receptor 1
Name:Cannabinoid receptor 1
Type:G Protein-Coupled Receptor (GPCR)
Mol. Mass.:52868.96
Organism:Homo sapiens (Human)
Description:P21554
Residue:472
BDBM50305414
NameBDBM50305414
Synonyms:1-(2-chlorophenyl)-5-(4-chlorophenyl)-4-(cyanomethyl)-N-((5-methylisoxazol-3-yl)methyl)-1H-pyrazole-3-carboxamide | CHEMBL589397
TypeSmall organic molecule
Emp. Form.C23H17Cl2N5O2
Mol. Mass.466.319
SMILESCc1cc(CNC(=O)c2nn(c(c2CC#N)-c2ccc(Cl)cc2)-c2ccccc2Cl)no1