Reaction Details
TargetCannabinoid receptor 1
LigandBDBM50305426
Substrate/Competitorn/a
Meas. Tech.ChEMBL_603744 (CHEMBL1039369)
IC50 31±n/a nM
Citation Cooper, MReceveur, JMBjurling, ENørregaard, PKNielsen, PASköld, NHögberg, T Exploring SAR features in diverse library of 4-cyanomethyl-pyrazole-3-carboxamides suitable for further elaborations as CB1 antagonists. Bioorg Med Chem Lett20:26-30 (2010) 
 
Cannabinoid receptor 1
Name:Cannabinoid receptor 1
Type:G Protein-Coupled Receptor (GPCR)
Mol. Mass.:52868.96
Organism:Homo sapiens (Human)
Description:P21554
Residue:472
BDBM50305426
NameBDBM50305426
Synonyms:1-(2-chlorophenyl)-5-(4-chlorophenyl)-4-(cyanomethyl)-N-(1-(methylsulfonyl)piperidin-4-yl)-1H-pyrazole-3-carboxamide | CHEMBL608861
TypeSmall organic molecule
Emp. Form.C24H23Cl2N5O3S
Mol. Mass.532.442
SMILESCS(=O)(=O)N1CCC(CC1)NC(=O)c1nn(c(c1CC#N)-c1ccc(Cl)cc1)-c1ccccc1Cl