Reaction Details
TargetCannabinoid receptor 1
LigandBDBM50305428
Substrate/Competitorn/a
Meas. Tech.ChEMBL_603744 (CHEMBL1039369)
IC50 7.3±n/a nM
Citation Cooper, MReceveur, JMBjurling, ENørregaard, PKNielsen, PASköld, NHögberg, T Exploring SAR features in diverse library of 4-cyanomethyl-pyrazole-3-carboxamides suitable for further elaborations as CB1 antagonists. Bioorg Med Chem Lett20:26-30 (2010) 
 
Cannabinoid receptor 1
Name:Cannabinoid receptor 1
Type:G Protein-Coupled Receptor (GPCR)
Mol. Mass.:52868.96
Organism:Homo sapiens (Human)
Description:P21554
Residue:472
BDBM50305428
NameBDBM50305428
Synonyms:CHEMBL589161 | methyl 2-(1-(2-chlorophenyl)-5-(4-chlorophenyl)-4-(cyanomethyl)-1H-pyrazole-3-carboxamido)-3-methylbutanoate
TypeSmall organic molecule
Emp. Form.C24H22Cl2N4O3
Mol. Mass.485.362
SMILESCOC(=O)C(NC(=O)c1nn(c(c1CC#N)-c1ccc(Cl)cc1)-c1ccccc1Cl)C(C)C