Reaction Details
TargetCannabinoid receptor 1
LigandBDBM50305432
Substrate/Competitorn/a
Meas. Tech.ChEMBL_603744 (CHEMBL1039369)
IC50 1±n/a nM
Citation Cooper, MReceveur, JMBjurling, ENørregaard, PKNielsen, PASköld, NHögberg, T Exploring SAR features in diverse library of 4-cyanomethyl-pyrazole-3-carboxamides suitable for further elaborations as CB1 antagonists. Bioorg Med Chem Lett20:26-30 (2010) 
 
Cannabinoid receptor 1
Name:Cannabinoid receptor 1
Type:G Protein-Coupled Receptor (GPCR)
Mol. Mass.:52868.96
Organism:Homo sapiens (Human)
Description:P21554
Residue:472
BDBM50305432
NameBDBM50305432
Synonyms:2-(1-(2-chlorophenyl)-5-(4-chlorophenyl)-3-(4-(4-fluorophenyl)piperidine-1-carbonyl)-1H-pyrazol-4-yl)acetonitrile | CHEMBL590380
TypeSmall organic molecule
Emp. Form.C29H23Cl2FN4O
Mol. Mass.533.424
SMILESFc1ccc(cc1)C1CCN(CC1)C(=O)c1nn(c(c1CC#N)-c1ccc(Cl)cc1)-c1ccccc1Cl