Reaction Details
TargetBeta-secretase 1
LigandBDBM50305481
Substrate/Competitorn/a
Meas. Tech.ChEMBL_603776 (CHEMBL1042914)
IC50 1040±n/a nM
Citation Nowak, PCole, DCAulabaugh, ABard, JChopra, RCowling, RFan, KYHu, BJacobsen, SJani, MJin, GLo, MCMalamas, MSManas, ESNarasimhan, RReinhart, PRobichaud, AJStock, JRSubrath, JSvenson, KTurner, JWagner, EZhou, PEllingboe, JW Discovery and initial optimization of 5,5'-disubstituted aminohydantoins as potent beta-secretase (BACE1) inhibitors. Bioorg Med Chem Lett20:632-5 (2010) 
 
Beta-secretase 1
Name:Beta-secretase 1
Type:Protein
Mol. Mass.:55755.10
Organism:Homo sapiens (Human)
Description:P56817
Residue:501
BDBM50305481
NameBDBM50305481
Synonyms:2-amino-4-cyclohexyl-4-phenyl-1-((tetrahydrofuran-2-yl)methyl)-1H-imidazol-5(4H)-one | CHEMBL592534
TypeSmall organic molecule
Emp. Form.C20H27N3O2
Mol. Mass.341.4473
SMILESNC1=NC(C2CCCCC2)(C(=O)N1CC1CCCO1)c1ccccc1