Reaction Details
TargetBeta-secretase 2
LigandBDBM50305476
Substrate/Competitorn/a
Meas. Tech.ChEMBL_603777 (CHEMBL1042915)
IC50 270±n/a nM
Citation Nowak, PCole, DCAulabaugh, ABard, JChopra, RCowling, RFan, KYHu, BJacobsen, SJani, MJin, GLo, MCMalamas, MSManas, ESNarasimhan, RReinhart, PRobichaud, AJStock, JRSubrath, JSvenson, KTurner, JWagner, EZhou, PEllingboe, JW Discovery and initial optimization of 5,5'-disubstituted aminohydantoins as potent beta-secretase (BACE1) inhibitors. Bioorg Med Chem Lett20:632-5 (2010) 
 
Beta-secretase 2
Name:Beta-secretase 2
Type:Protein
Mol. Mass.:56171.20
Organism:Homo sapiens (Human)
Description:Q9Y5Z0
Residue:518
BDBM50305476
NameBDBM50305476
Synonyms:2-amino-4-cyclohexyl-1-hexyl-4-phenyl-1H-imidazol-5(4H)-one | CHEMBL593979
TypeSmall organic molecule
Emp. Form.C21H31N3O
Mol. Mass.341.4903
SMILESCCCCCCN1C(N)=NC(C2CCCCC2)(C1=O)c1ccccc1