Reaction Details
TargetBeta-secretase 2
LigandBDBM50305477
Substrate/Competitorn/a
Meas. Tech.ChEMBL_603777 (CHEMBL1042915)
IC50 310±n/a nM
Citation Nowak, PCole, DCAulabaugh, ABard, JChopra, RCowling, RFan, KYHu, BJacobsen, SJani, MJin, GLo, MCMalamas, MSManas, ESNarasimhan, RReinhart, PRobichaud, AJStock, JRSubrath, JSvenson, KTurner, JWagner, EZhou, PEllingboe, JW Discovery and initial optimization of 5,5'-disubstituted aminohydantoins as potent beta-secretase (BACE1) inhibitors. Bioorg Med Chem Lett20:632-5 (2010) 
 
Beta-secretase 2
Name:Beta-secretase 2
Type:Protein
Mol. Mass.:56171.20
Organism:Homo sapiens (Human)
Description:Q9Y5Z0
Residue:518
BDBM50305477
NameBDBM50305477
Synonyms:6-(2-amino-4-cyclohexyl-5-oxo-4-phenyl-4,5-dihydro-1H-imidazol-1-yl)hexanoic acid | CHEMBL607527
TypeSmall organic molecule
Emp. Form.C21H29N3O3
Mol. Mass.371.4733
SMILESNC1=NC(C2CCCCC2)(C(=O)N1CCCCCC(O)=O)c1ccccc1