Reaction Details
TargetAmyloid-beta precursor protein
LigandBDBM50300710
Substrate/Competitorn/a
Meas. Tech.ChEMBL_603778 (CHEMBL1042916)
EC50 16000±n/a nM
Citation Nowak, PCole, DCAulabaugh, ABard, JChopra, RCowling, RFan, KYHu, BJacobsen, SJani, MJin, GLo, MCMalamas, MSManas, ESNarasimhan, RReinhart, PRobichaud, AJStock, JRSubrath, JSvenson, KTurner, JWagner, EZhou, PEllingboe, JW Discovery and initial optimization of 5,5'-disubstituted aminohydantoins as potent beta-secretase (BACE1) inhibitors. Bioorg Med Chem Lett20:632-5 (2010) 
 
Amyloid-beta precursor protein
Name:Amyloid-beta precursor protein
Type:Single-pass type I membrane protein
Mol. Mass.:86890.41
Organism:Homo sapiens (Human)
Description:P05067
Residue:770
BDBM50300710
NameBDBM50300710
Synonyms:8,8-diphenyl-2,3,4,8-tetrahydroimidazo[1,5-a]pyrimidin-6-amine | CHEMBL582044
TypeSmall organic molecule
Emp. Form.C18H18N4
Mol. Mass.290.3623
SMILESNC1=NC(C2=NCCCN12)(c1ccccc1)c1ccccc1