Reaction Details
TargetOxysterols receptor LXR-beta
LigandBDBM50305499
Substrate/Competitorn/a
Meas. Tech.ChEMBL_604017 (CHEMBL1049545)
IC50 2.2±n/a nM
Citation Hu, BBernotas, RUnwalla, RCollini, MQuinet, EFeingold, IGoos-Nilsson, AWilhelmsson, ANambi, PEvans, MWrobel, J Quinoline-3-carboxamide containing sulfones as liver X receptor (LXR) agonists with binding selectivity for LXRbeta and low blood-brain penetration. Bioorg Med Chem Lett20:689-93 (2010) 
 
Oxysterols receptor LXR-beta
Name:Oxysterols receptor LXR-beta
Type:Enzyme Catalytic Domain
Mol. Mass.:50978.79
Organism:Homo sapiens (Human)
Description:P55055
Residue:460
BDBM50305499
NameBDBM50305499
Synonyms:4-(3-(3-(methylsulfonyl)phenoxy)phenyl)-8-(trifluoromethyl)quinoline-3-carbonitrile | CHEMBL600244
TypeSmall organic molecule
Emp. Form.C24H15F3N2O3S
Mol. Mass.468.448
SMILESCS(=O)(=O)c1cccc(Oc2cccc(c2)-c2c(cnc3c(cccc23)C(F)(F)F)C#N)c1