Reaction Details
TargetGrowth hormone secretagogue receptor type 1
LigandBDBM50305506
Substrate/Competitorn/a
Meas. Tech.ChEMBL_604239 (CHEMBL1050384)
Ki 4400±n/a nM
Citation Brown, ABrown, TBCalabrese, AEllis, DPuhalo, NRalph, MWatson, L Triazole oxytocin antagonists: Identification of an aryloxyazetidine replacement for a biaryl substituent. Bioorg Med Chem Lett20:516-20 (2010) 
 
Growth hormone secretagogue receptor type 1
Name:Growth hormone secretagogue receptor type 1
Type:Receptor
Mol. Mass.:41334.57
Organism:Homo sapiens (Human)
Description:Receptor binding studies use plasma membranes from LLC PK-1 cells transiently transfected with hGHSR1a.
Residue:366
BDBM50305506
NameBDBM50305506
Synonyms:5-(3-(3-(2-chloro-4-fluorophenoxy)azetidin-1-yl)-5-(methoxymethyl)-4H-1,2,4-triazol-4-yl)-2-methoxypyridine | CHEMBL594828
TypeSmall organic molecule
Emp. Form.C19H19ClFN5O3
Mol. Mass.419.837
SMILESCOCc1nnc(N2CC(C2)Oc2ccc(F)cc2Cl)n1-c1ccc(OC)nc1