Reaction Details
TargetVasopressin V2 receptor
LigandBDBM50305508
Substrate/Competitorn/a
Meas. Tech.ChEMBL_604220 (CHEMBL1050365)
Ki>10000±n/a nM
Citation Brown, ABrown, TBCalabrese, AEllis, DPuhalo, NRalph, MWatson, L Triazole oxytocin antagonists: Identification of an aryloxyazetidine replacement for a biaryl substituent. Bioorg Med Chem Lett20:516-20 (2010) 
 
Vasopressin V2 receptor
Name:Vasopressin V2 receptor
Type:Receptor
Mol. Mass.:40295.28
Organism:Homo sapiens (Human)
Description:P30518
Residue:371
BDBM50305508
NameBDBM50305508
Synonyms:2-methoxy-5-(3-methyl-5-(4-(o-tolyloxy)piperidin-1-yl)-4H-1,2,4-triazol-4-yl)pyridine | CHEMBL592493
TypeSmall organic molecule
Emp. Form.C21H25N5O2
Mol. Mass.379.4555
SMILESCOc1ccc(cn1)-n1c(C)nnc1N1CCC(CC1)Oc1ccccc1C