Reaction Details
TargetVasopressin V2 receptor
LigandBDBM50305516
Substrate/Competitorn/a
Meas. Tech.ChEMBL_604220 (CHEMBL1050365)
Ki>10000±n/a nM
Citation Brown, ABrown, TBCalabrese, AEllis, DPuhalo, NRalph, MWatson, L Triazole oxytocin antagonists: Identification of an aryloxyazetidine replacement for a biaryl substituent. Bioorg Med Chem Lett20:516-20 (2010) 
 
Vasopressin V2 receptor
Name:Vasopressin V2 receptor
Type:Receptor
Mol. Mass.:40295.28
Organism:Homo sapiens (Human)
Description:P30518
Residue:371
BDBM50305516
NameBDBM50305516
Synonyms:(R)-2-methoxy-5-(3-(methoxymethyl)-5-(3-(o-tolyloxy)pyrrolidin-1-yl)-4H-1,2,4-triazol-4-yl)pyridine | CHEMBL590097
TypeSmall organic molecule
Emp. Form.C21H25N5O3
Mol. Mass.395.4549
SMILESCOCc1nnc(N2CC[C@H](C2)Oc2ccccc2C)n1-c1ccc(OC)nc1