Reaction Details
TargetVasopressin V2 receptor
LigandBDBM50305525
Substrate/Competitorn/a
Meas. Tech.ChEMBL_604220 (CHEMBL1050365)
Ki 2770±n/a nM
Citation Brown, ABrown, TBCalabrese, AEllis, DPuhalo, NRalph, MWatson, L Triazole oxytocin antagonists: Identification of an aryloxyazetidine replacement for a biaryl substituent. Bioorg Med Chem Lett20:516-20 (2010) 
 
Vasopressin V2 receptor
Name:Vasopressin V2 receptor
Type:Receptor
Mol. Mass.:40295.28
Organism:Homo sapiens (Human)
Description:P30518
Residue:371
BDBM50305525
NameBDBM50305525
Synonyms:5-(3-(3-(5-fluoro-2-methylphenoxy)azetidin-1-yl)-5-methyl-4H-1,2,4-triazol-4-yl)-2-methoxypyridine | CHEMBL602641
TypeSmall organic molecule
Emp. Form.C19H20FN5O2
Mol. Mass.369.3928
SMILESCOc1ccc(cn1)-n1c(C)nnc1N1CC(C1)Oc1cc(F)ccc1C