Reaction Details
TargetVasopressin V2 receptor
LigandBDBM50305526
Substrate/Competitorn/a
Meas. Tech.ChEMBL_604220 (CHEMBL1050365)
Ki 1190±n/a nM
Citation Brown, ABrown, TBCalabrese, AEllis, DPuhalo, NRalph, MWatson, L Triazole oxytocin antagonists: Identification of an aryloxyazetidine replacement for a biaryl substituent. Bioorg Med Chem Lett20:516-20 (2010) 
 
Vasopressin V2 receptor
Name:Vasopressin V2 receptor
Type:Receptor
Mol. Mass.:40295.28
Organism:Homo sapiens (Human)
Description:P30518
Residue:371
BDBM50305526
NameBDBM50305526
Synonyms:5-(3-(3-(4-fluoro-2-methylphenoxy)azetidin-1-yl)-5-(methoxymethyl)-4H-1,2,4-triazol-4-yl)-2-methoxypyridine | CHEMBL589128
TypeSmall organic molecule
Emp. Form.C20H22FN5O3
Mol. Mass.399.4188
SMILESCOCc1nnc(N2CC(C2)Oc2ccc(F)cc2C)n1-c1ccc(OC)nc1