Reaction Details
TargetOxytocin receptor
LigandBDBM50305507
Substrate/Competitorn/a
Meas. Tech.ChEMBL_604218 (CHEMBL1050363)
Ki 114±n/a nM
Citation Brown, ABrown, TBCalabrese, AEllis, DPuhalo, NRalph, MWatson, L Triazole oxytocin antagonists: Identification of an aryloxyazetidine replacement for a biaryl substituent. Bioorg Med Chem Lett20:516-20 (2010) 
 
Oxytocin receptor
Name:Oxytocin receptor
Type:Enzyme Catalytic Domain
Mol. Mass.:42793.26
Organism:Homo sapiens (Human)
Description:Oxytocin OXTR HEK293::B2R9L7
Residue:389
BDBM50305507
NameBDBM50305507
Synonyms:2-methoxy-5-(3-methyl-5-(4-phenoxypiperidin-1-yl)-4H-1,2,4-triazol-4-yl)pyridine | CHEMBL592250
TypeSmall organic molecule
Emp. Form.C20H23N5O2
Mol. Mass.365.4289
SMILESCOc1ccc(cn1)-n1c(C)nnc1N1CCC(CC1)Oc1ccccc1