Reaction Details
TargetOxytocin receptor
LigandBDBM50305517
Substrate/Competitorn/a
Meas. Tech.ChEMBL_604218 (CHEMBL1050363)
Ki 17.9±n/a nM
Citation Brown, ABrown, TBCalabrese, AEllis, DPuhalo, NRalph, MWatson, L Triazole oxytocin antagonists: Identification of an aryloxyazetidine replacement for a biaryl substituent. Bioorg Med Chem Lett20:516-20 (2010) 
 
Oxytocin receptor
Name:Oxytocin receptor
Type:Enzyme Catalytic Domain
Mol. Mass.:42793.26
Organism:Homo sapiens (Human)
Description:Oxytocin OXTR HEK293::B2R9L7
Residue:389
BDBM50305517
NameBDBM50305517
Synonyms:(R)-5-(3-(3-(4-fluoro-2-methylphenoxy)pyrrolidin-1-yl)-5-(methoxymethyl)-4H-1,2,4-triazol-4-yl)-2-methoxypyridine | CHEMBL592732
TypeSmall organic molecule
Emp. Form.C21H24FN5O3
Mol. Mass.413.4454
SMILESCOCc1nnc(N2CC[C@H](C2)Oc2ccc(F)cc2C)n1-c1ccc(OC)nc1