Reaction Details
TargetVasopressin V1a receptor
LigandBDBM50305512
Substrate/Competitorn/a
Meas. Tech.ChEMBL_604219 (CHEMBL1050364)
Ki 24.4±n/a nM
Citation Brown, ABrown, TBCalabrese, AEllis, DPuhalo, NRalph, MWatson, L Triazole oxytocin antagonists: Identification of an aryloxyazetidine replacement for a biaryl substituent. Bioorg Med Chem Lett20:516-20 (2010) 
 
Vasopressin V1a receptor
Name:Vasopressin V1a receptor
Type:Receptor
Mol. Mass.:46820.18
Organism:Homo sapiens (Human)
Description:P37288
Residue:418
BDBM50305512
NameBDBM50305512
Synonyms:2-methoxy-5-(3-(methoxymethyl)-5-(4-(o-tolyloxy)piperidin-1-yl)-4H-1,2,4-triazol-4-yl)pyridine | CHEMBL592495
TypeSmall organic molecule
Emp. Form.C22H27N5O3
Mol. Mass.409.4815
SMILESCOCc1nnc(N2CCC(CC2)Oc2ccccc2C)n1-c1ccc(OC)nc1