Reaction Details
TargetVasopressin V1a receptor
LigandBDBM50305514
Substrate/Competitorn/a
Meas. Tech.ChEMBL_604219 (CHEMBL1050364)
Ki 734±n/a nM
Citation Brown, ABrown, TBCalabrese, AEllis, DPuhalo, NRalph, MWatson, L Triazole oxytocin antagonists: Identification of an aryloxyazetidine replacement for a biaryl substituent. Bioorg Med Chem Lett20:516-20 (2010) 
 
Vasopressin V1a receptor
Name:Vasopressin V1a receptor
Type:Receptor
Mol. Mass.:46820.18
Organism:Homo sapiens (Human)
Description:P37288
Residue:418
BDBM50305514
NameBDBM50305514
Synonyms:(R)-2-methoxy-5-(3-methyl-5-(3-(o-tolyloxy)pyrrolidin-1-yl)-4H-1,2,4-triazol-4-yl)pyridine | CHEMBL592731
TypeSmall organic molecule
Emp. Form.C20H23N5O2
Mol. Mass.365.4289
SMILESCOc1ccc(cn1)-n1c(C)nnc1N1CC[C@H](C1)Oc1ccccc1C