Reaction Details
TargetCathepsin E
LigandBDBM50305537
Substrate/Competitorn/a
Meas. Tech.ChEMBL_604246 (CHEMBL1050391)
IC50 4±n/a nM
Citation Lerchner, AMachauer, RBetschart, CVeenstra, SRueeger, HMcCarthy, CTintelnot-Blomley, MJaton, ALRabe, SDesrayaud, SEnz, AStaufenbiel, MPaganetti, PRondeau, JMNeumann, U Macrocyclic BACE-1 inhibitors acutely reduce Abeta in brain after po application. Bioorg Med Chem Lett20:603-7 (2010) 
 
Cathepsin E
Name:Cathepsin E
Type:Enzyme
Mol. Mass.:43298.99
Organism:Homo sapiens (Human)
Description:P14091
Residue:396
BDBM50305537
NameBDBM50305537
Synonyms:(S)-4-{(R)-1-Hydroxy-2-[1-(3-isopropyl-phenyl)-cyclopropylamino]-ethyl}-19-methyl-11,16-dioxa-3,18-diaza-tricyclo[15.3.1.1*6,10*]docosa-1(21),6(22),7,9,17,19-hexaen-2-one | CHEMBL600326
TypeSmall organic molecule
Emp. Form.C33H41N3O4
Mol. Mass.543.6963
SMILESCC(C)c1cccc(c1)C1(CC1)NC[C@@H](O)[C@@H]1Cc2cccc(OCCCCOc3cc(cc(C)n3)C(=O)N1)c2