Reaction Details
TargetAmine oxidase [flavin-containing] A
LigandBDBM100152
Substrate/Competitorn/a
Meas. Tech.ChEMBL_604552 (CHEMBL1074724)
Ki 5±n/a nM
Citation Rahman, TRahmatullah, M Proposed structural basis of interaction of piperine and related compounds with monoamine oxidases. Bioorg Med Chem Lett20:537-40 (2010) 
 
Amine oxidase [flavin-containing] A
Name:Amine oxidase [flavin-containing] A
Type:Protein
Mol. Mass.:59689.53
Organism:Homo sapiens (Human)
Description:P21397
Residue:527
BDBM100152
NameBDBM100152
Synonyms:7-methoxy-1-methyl-9H-beta-carboline;hydrochloride HARMINE MLS002153910 cid_5359389
TypeSmall organic molecule
Emp. Form.C13H12N2O
Mol. Mass.212.2472
SMILESCOc1ccc2c(c1)[nH]c1c(C)nccc21