Reaction Details
TargetPhosphatidylinositol 4,5-bisphosphate 3-kinase catalytic subunit alpha isoform
LigandBDBM35600
Substrate/Competitorn/a
Meas. Tech.ChEMBL_604557 (CHEMBL1074729)
IC50 32±n/a nM
Citation Gilbert, AMNowak, PBrooijmans, NBursavich, MGDehnhardt, CSantos, EDFeldberg, LRHollander, IKim, SLombardi, SPark, KVenkatesan, AMMallon, R Novel purine and pyrazolo[3,4-d]pyrimidine inhibitors of PI3 kinase-alpha: Hit to lead studies. Bioorg Med Chem Lett20:636-9 (2010) 
 
Phosphatidylinositol 4,5-bisphosphate 3-kinase catalytic subunit alpha isoform
Name:Phosphatidylinositol 4,5-bisphosphate 3-kinase catalytic subunit alpha isoform
Type:Enzyme Subunit
Mol. Mass.:124294.87
Organism:Homo sapiens (Human)
Description:P42336
Residue:1068
BDBM35600
NameBDBM35600
Synonyms:pyrazolo pyrimidine, 5e
TypeSmall organic molecule
Emp. Form.C27H30N6O2
Mol. Mass.470.5661
SMILESOc1cccc(c1)-c1nc(N2CCOCC2)c2cnn(C3CCN(Cc4ccccc4)CC3)c2n1