Reaction Details
TargetC5a anaphylatoxin chemotactic receptor 1
LigandBDBM50305741
Substrate/Competitorn/a
Meas. Tech.ChEMBL_604751 (CHEMBL1072545)
IC50>60000±n/a nM
Citation Chen, JJCole, DCCiszewski, GCrouse, KEllingboe, JWNowak, PTawa, GJBerstein, GLi, W Identification of a new class of small molecule C5a receptor antagonists. Bioorg Med Chem Lett20:662-4 (2010) 
 
C5a anaphylatoxin chemotactic receptor 1
Name:C5a anaphylatoxin chemotactic receptor 1
Type:Enzyme
Mol. Mass.:39347.68
Organism:Homo sapiens (Human)
Description:P21730
Residue:350
BDBM50305741
NameBDBM50305741
Synonyms:1,4-ditosylpiperazine | CHEMBL596080
TypeSmall organic molecule
Emp. Form.C18H22N2O4S2
Mol. Mass.394.508
SMILESCc1ccc(cc1)S(=O)(=O)N1CCN(CC1)S(=O)(=O)c1ccc(C)cc1