Reaction Details
TargetC5a anaphylatoxin chemotactic receptor 1
LigandBDBM50305733
Substrate/Competitorn/a
Meas. Tech.ChEMBL_604750 (CHEMBL1072544)
IC50 14600±n/a nM
Citation Chen, JJCole, DCCiszewski, GCrouse, KEllingboe, JWNowak, PTawa, GJBerstein, GLi, W Identification of a new class of small molecule C5a receptor antagonists. Bioorg Med Chem Lett20:662-4 (2010) 
 
C5a anaphylatoxin chemotactic receptor 1
Name:C5a anaphylatoxin chemotactic receptor 1
Type:Enzyme
Mol. Mass.:39347.68
Organism:Homo sapiens (Human)
Description:P21730
Residue:350
BDBM50305733
NameBDBM50305733
Synonyms:CHEMBL596055 | N-(2-benzoyl-4-bromophenyl)-N,4-dimethylbenzenesulfonamide
TypeSmall organic molecule
Emp. Form.C21H18BrNO3S
Mol. Mass.444.342
SMILESCN(c1ccc(Br)cc1C(=O)c1ccccc1)S(=O)(=O)c1ccc(C)cc1