Reaction Details
TargetC-C chemokine receptor type 5
LigandBDBM50305799
Substrate/Competitorn/a
Meas. Tech.ChEMBL_604792 (CHEMBL1072586)
IC50 1±n/a nM
Citation Lemoine, RCPetersen, ACSetti, LWanner, JJekle, AHeilek, GdeRosier, AJi, CBerry, PRotstein, D Evaluation of secondary amide replacements in a series of CCR5 antagonists as a means to increase intrinsic membrane permeability. Part 1: Optimization of gem-disubstituted azacycles. Bioorg Med Chem Lett20:704-8 (2010) 
 
C-C chemokine receptor type 5
Name:C-C chemokine receptor type 5
Type:Enzyme
Mol. Mass.:40540.21
Organism:Homo sapiens (Human)
Description:P51681
Residue:352
BDBM50305799
NameBDBM50305799
Synonyms:5-((3aR,6aS)-5-(2-(1-(3,3-difluorocyclobutanecarbonyl)-3-phenylazetidin-3-yl)ethyl)octahydropyrrolo[3,4-c]pyrrole-2-carbonyl)-4,6-dimethylpicolinonitrile | CHEMBL593042
TypeSmall organic molecule
Emp. Form.C31H35F2N5O2
Mol. Mass.547.6387
SMILESCc1cc(nc(C)c1C(=O)N1C[C@@H]2CN(CCC3(CN(C3)C(=O)C3CC(F)(F)C3)c3ccccc3)C[C@@H]2C1)C#N