Reaction Details
TargetC-C chemokine receptor type 5
LigandBDBM50305800
Substrate/Competitorn/a
Meas. Tech.ChEMBL_604792 (CHEMBL1072586)
IC50 2±n/a nM
Citation Lemoine, RCPetersen, ACSetti, LWanner, JJekle, AHeilek, GdeRosier, AJi, CBerry, PRotstein, D Evaluation of secondary amide replacements in a series of CCR5 antagonists as a means to increase intrinsic membrane permeability. Part 1: Optimization of gem-disubstituted azacycles. Bioorg Med Chem Lett20:704-8 (2010) 
 
C-C chemokine receptor type 5
Name:C-C chemokine receptor type 5
Type:Enzyme
Mol. Mass.:40540.21
Organism:Homo sapiens (Human)
Description:P51681
Residue:352
BDBM50305800
NameBDBM50305800
Synonyms:((3aR,6aS)-5-(2-(1-(4,4-difluorocyclohexanecarbonyl)-3-phenylazetidin-3-yl)ethyl)hexahydropyrrolo[3,4-c]pyrrol-2(1H)-yl)(2,4-dimethyl-6-(trifluoromethyl)pyridin-3-yl)methanone | CHEMBL593046
TypeSmall organic molecule
Emp. Form.C33H39F5N4O2
Mol. Mass.618.6804
SMILESCc1cc(nc(C)c1C(=O)N1C[C@@H]2CN(CCC3(CN(C3)C(=O)C3CCC(F)(F)CC3)c3ccccc3)C[C@@H]2C1)C(F)(F)F