Reaction Details
TargetCollagenase 3
LigandBDBM50305846
Substrate/Competitorn/a
Meas. Tech.ChEMBL_605223 (CHEMBL1069934)
Ki 31±n/a nM
Citation Schnute, MEO'Brien, PMNahra, JMorris, MHoward Roark, WHanau, CERuminski, PGScholten, JAFletcher, TRHamper, BCCarroll, JNPatt, WCShieh, HSCollins, BPavlovsky, AGPalmquist, KEAston, KWHitchcock, JRogers, MDMcDonald, JJohnson, ARMunie, GEWittwer, AJMan, CFSettle, SLNemirovskiy, OVickery, LEAgawal, ADyer, RDSunyer, T Discovery of (pyridin-4-yl)-2H-tetrazole as a novel scaffold to identify highly selective matrix metalloproteinase-13 inhibitors for the treatment of osteoarthritis. Bioorg Med Chem Lett20:576-80 (2010) 
 
Collagenase 3
Name:Collagenase 3
Type:Enzyme
Mol. Mass.:53808.06
Organism:Homo sapiens (Human)
Description:P45452
Residue:471
BDBM50305846
NameBDBM50305846
Synonyms:CHEMBL596522 | trans-4-((5-(2-(benzylcarbamoyl)-6-methylpyridin-4-yl)-2H-tetrazol-2-yl)methyl)cyclohexanecarboxylic acid
TypeSmall organic molecule
Emp. Form.C23H26N6O3
Mol. Mass.434.4909
SMILESCc1cc(cc(n1)C(=O)NCc1ccccc1)-c1nnn(C[C@H]2CC[C@@H](CC2)C(O)=O)n1