Reaction Details
TargetMetabotropic glutamate receptor 7
LigandBDBM50305860
Substrate/Competitorn/a
Meas. Tech.ChEMBL_605281 (CHEMBL1069931)
IC50 910±n/a nM
Citation Nakamura, MKurihara, HSuzuki, GMitsuya, MOhkubo, MOhta, H Isoxazolopyridone derivatives as allosteric metabotropic glutamate receptor 7 antagonists. Bioorg Med Chem Lett20:726-9 (2010) 
 
Metabotropic glutamate receptor 7
Name:Metabotropic glutamate receptor 7
Type:Enzyme
Mol. Mass.:102244.48
Organism:Rattus norvegicus (Rat)
Description:P35400
Residue:915
BDBM50305860
NameBDBM50305860
Synonyms:5-ethyl-3,6-diphenylisoxazolo[4,5-c]pyridin-4(5H)-one | CHEMBL596305
TypeSmall organic molecule
Emp. Form.C20H16N2O2
Mol. Mass.316.3532
SMILESCCn1c(cc2onc(-c3ccccc3)c2c1=O)-c1ccccc1