Reaction Details
TargetMetabotropic glutamate receptor 7
LigandBDBM50305864
Substrate/Competitorn/a
Meas. Tech.ChEMBL_605281 (CHEMBL1069931)
IC50 21±n/a nM
Citation Nakamura, MKurihara, HSuzuki, GMitsuya, MOhkubo, MOhta, H Isoxazolopyridone derivatives as allosteric metabotropic glutamate receptor 7 antagonists. Bioorg Med Chem Lett20:726-9 (2010) 
 
Metabotropic glutamate receptor 7
Name:Metabotropic glutamate receptor 7
Type:Enzyme
Mol. Mass.:102244.48
Organism:Rattus norvegicus (Rat)
Description:P35400
Residue:915
BDBM50305864
NameBDBM50305864
Synonyms:3-(2-methoxyphenyl)-5-methyl-6-phenylisoxazolo[4,5-c]pyridin-4(5H)-one | CHEMBL595402
TypeSmall organic molecule
Emp. Form.C20H16N2O3
Mol. Mass.332.3526
SMILESCOc1ccccc1-c1noc2cc(-c3ccccc3)n(C)c(=O)c12