Reaction Details
TargetMetabotropic glutamate receptor 7
LigandBDBM50305865
Substrate/Competitorn/a
Meas. Tech.ChEMBL_605281 (CHEMBL1069931)
IC50 101±n/a nM
Citation Nakamura, MKurihara, HSuzuki, GMitsuya, MOhkubo, MOhta, H Isoxazolopyridone derivatives as allosteric metabotropic glutamate receptor 7 antagonists. Bioorg Med Chem Lett20:726-9 (2010) 
 
Metabotropic glutamate receptor 7
Name:Metabotropic glutamate receptor 7
Type:Enzyme
Mol. Mass.:102244.48
Organism:Rattus norvegicus (Rat)
Description:P35400
Residue:915
BDBM50305865
NameBDBM50305865
Synonyms:5-methyl-6-phenyl-3-(pyridin-4-yl)isoxazolo[4,5-c]pyridin-4(5H)-one | CHEMBL592956
TypeSmall organic molecule
Emp. Form.C18H13N3O2
Mol. Mass.303.3147
SMILESCn1c(cc2onc(-c3ccncc3)c2c1=O)-c1ccccc1