Reaction Details
TargetMetabotropic glutamate receptor 7
LigandBDBM50305874
Substrate/Competitorn/a
Meas. Tech.ChEMBL_605281 (CHEMBL1069931)
IC50 96±n/a nM
Citation Nakamura, MKurihara, HSuzuki, GMitsuya, MOhkubo, MOhta, H Isoxazolopyridone derivatives as allosteric metabotropic glutamate receptor 7 antagonists. Bioorg Med Chem Lett20:726-9 (2010) 
 
Metabotropic glutamate receptor 7
Name:Metabotropic glutamate receptor 7
Type:Enzyme
Mol. Mass.:102244.48
Organism:Rattus norvegicus (Rat)
Description:P35400
Residue:915
BDBM50305874
NameBDBM50305874
Synonyms:5-methyl-3-phenyl-6-(3-(trifluoromethyl)phenyl)isoxazolo[4,5-c]pyridin-4(5H)-one | CHEMBL594448
TypeSmall organic molecule
Emp. Form.C20H13F3N2O2
Mol. Mass.370.3246
SMILESCn1c(cc2onc(-c3ccccc3)c2c1=O)-c1cccc(c1)C(F)(F)F