Reaction Details
TargetRAC-gamma serine/threonine-protein kinase
LigandBDBM50305883
Substrate/Competitorn/a
Meas. Tech.ChEMBL_605291 (CHEMBL1069943)
IC50 1±n/a nM
Citation Lin, HYamashita, DSZeng, JXie, RVerma, SLuengo, JIRhodes, NZhang, SRobell, KAChoudhry, AELai, ZKumar, RMinthorn, EABrown, KKHeerding, DA 2,3,5-Trisubstituted pyridines as selective AKT inhibitors. Part II: Improved drug-like properties and kinase selectivity from azaindazoles. Bioorg Med Chem Lett20:679-83 (2010) 
 
RAC-gamma serine/threonine-protein kinase
Name:RAC-gamma serine/threonine-protein kinase
Type:Enzyme
Mol. Mass.:55769.36
Organism:Homo sapiens (Human)
Description:n/a
Residue:479
BDBM50305883
NameBDBM50305883
Synonyms:(S)-1-(6-(furan-3-yl)-5-(3-methyl-1H-pyrazolo[3,4-c]pyridin-5-yl)pyridin-3-yloxy)-3-(1H-indol-3-yl)propan-2-amine | CHEMBL594933
TypeSmall organic molecule
Emp. Form.C27H24N6O2
Mol. Mass.464.5185
SMILESCc1n[nH]c2cnc(cc12)-c1cc(OC[C@@H](N)Cc2c[nH]c3ccccc23)cnc1-c1ccoc1