Reaction Details
TargetFree fatty acid receptor 2
LigandBDBM50305908
Substrate/Competitorn/a
Meas. Tech.ChEMBL_605612 (CHEMBL1069216)
IC50 1500±n/a nM
Citation Wang, YJiao, XKayser, FLiu, JWang, ZWanska, MGreenberg, JWeiszmann, JGe, HTian, HWong, SSchwandner, RLee, TLi, Y The first synthetic agonists of FFA2: Discovery and SAR of phenylacetamides as allosteric modulators. Bioorg Med Chem Lett20:493-8 (2010) 
 
Free fatty acid receptor 2
Name:Free fatty acid receptor 2
Type:PROTEIN
Mol. Mass.:37156.44
Organism:Homo sapiens (Human)
Description:ChEMBL_1508993
Residue:330
BDBM50305908
NameBDBM50305908
Synonyms:(S)-2-(4-chlorophenyl)-3,3-dimethyl-N-(5-(trifluoromethyl)thiazol-2-yl)butanamide | CHEMBL611340
TypeSmall organic molecule
Emp. Form.C16H16ClF3N2OS
Mol. Mass.376.824
SMILESCC(C)(C)[C@H](C(=O)Nc1ncc(s1)C(F)(F)F)c1ccc(Cl)cc1