Reaction Details
TargetFree fatty acid receptor 2
LigandBDBM50305917
Substrate/Competitorn/a
Meas. Tech.ChEMBL_605612 (CHEMBL1069216)
IC50 1200±n/a nM
Citation Wang, YJiao, XKayser, FLiu, JWang, ZWanska, MGreenberg, JWeiszmann, JGe, HTian, HWong, SSchwandner, RLee, TLi, Y The first synthetic agonists of FFA2: Discovery and SAR of phenylacetamides as allosteric modulators. Bioorg Med Chem Lett20:493-8 (2010) 
 
Free fatty acid receptor 2
Name:Free fatty acid receptor 2
Type:PROTEIN
Mol. Mass.:37156.44
Organism:Homo sapiens (Human)
Description:ChEMBL_1508993
Residue:330
BDBM50305917
NameBDBM50305917
Synonyms:(S)-2-(4-chlorophenyl)-N-(5-(1,1,1,3,3,3-hexafluoro-2-hydroxypropan-2-yl)thiazol-2-yl)-3,3-dimethylbutanamide | CHEMBL606629
TypeSmall organic molecule
Emp. Form.C18H17ClF6N2O2S
Mol. Mass.474.848
SMILESCC(C)(C)[C@H](C(=O)Nc1ncc(s1)C(O)(C(F)(F)F)C(F)(F)F)c1ccc(Cl)cc1