Reaction Details
TargetFree fatty acid receptor 2
LigandBDBM50305926
Substrate/Competitorn/a
Meas. Tech.ChEMBL_605612 (CHEMBL1069216)
IC50 1100±n/a nM
Citation Wang, YJiao, XKayser, FLiu, JWang, ZWanska, MGreenberg, JWeiszmann, JGe, HTian, HWong, SSchwandner, RLee, TLi, Y The first synthetic agonists of FFA2: Discovery and SAR of phenylacetamides as allosteric modulators. Bioorg Med Chem Lett20:493-8 (2010) 
 
Free fatty acid receptor 2
Name:Free fatty acid receptor 2
Type:PROTEIN
Mol. Mass.:37156.44
Organism:Homo sapiens (Human)
Description:ChEMBL_1508993
Residue:330
BDBM50305926
NameBDBM50305926
Synonyms:(S)-2-(4-chlorophenyl)-N-(thiazol-2-yl)pent-4-enamide | CHEMBL594738
TypeSmall organic molecule
Emp. Form.C14H13ClN2OS
Mol. Mass.292.784
SMILESClc1ccc(cc1)[C@H](CC=C)C(=O)Nc1nccs1