Reaction Details
TargetFree fatty acid receptor 2
LigandBDBM50305930
Substrate/Competitorn/a
Meas. Tech.ChEMBL_605612 (CHEMBL1069216)
IC50 1500±n/a nM
Citation Wang, YJiao, XKayser, FLiu, JWang, ZWanska, MGreenberg, JWeiszmann, JGe, HTian, HWong, SSchwandner, RLee, TLi, Y The first synthetic agonists of FFA2: Discovery and SAR of phenylacetamides as allosteric modulators. Bioorg Med Chem Lett20:493-8 (2010) 
 
Free fatty acid receptor 2
Name:Free fatty acid receptor 2
Type:PROTEIN
Mol. Mass.:37156.44
Organism:Homo sapiens (Human)
Description:ChEMBL_1508993
Residue:330
BDBM50305930
NameBDBM50305930
Synonyms:1-(4-chlorophenyl)-N-(5-fluorothiazol-2-yl)cyclobutanecarboxamide | CHEMBL609291
TypeSmall organic molecule
Emp. Form.C14H12ClFN2OS
Mol. Mass.310.774
SMILESFc1cnc(NC(=O)C2(CCC2)c2ccc(Cl)cc2)s1