Reaction Details
TargetFree fatty acid receptor 2
LigandBDBM50305950
Substrate/Competitorn/a
Meas. Tech.ChEMBL_605612 (CHEMBL1069216)
IC50 1100±n/a nM
Citation Wang, YJiao, XKayser, FLiu, JWang, ZWanska, MGreenberg, JWeiszmann, JGe, HTian, HWong, SSchwandner, RLee, TLi, Y The first synthetic agonists of FFA2: Discovery and SAR of phenylacetamides as allosteric modulators. Bioorg Med Chem Lett20:493-8 (2010) 
 
Free fatty acid receptor 2
Name:Free fatty acid receptor 2
Type:PROTEIN
Mol. Mass.:37156.44
Organism:Homo sapiens (Human)
Description:ChEMBL_1508993
Residue:330
BDBM50305950
NameBDBM50305950
Synonyms:(S)-2-(4-chlorophenyl)-N-(6-fluoropyridin-2-yl)-3-methylbutanamide | CHEMBL594746
TypeSmall organic molecule
Emp. Form.C16H16ClFN2O
Mol. Mass.306.762
SMILESCC(C)[C@H](C(=O)Nc1cccc(F)n1)c1ccc(Cl)cc1