Reaction Details
TargetFree fatty acid receptor 2
LigandBDBM50305957
Substrate/Competitorn/a
Meas. Tech.ChEMBL_605612 (CHEMBL1069216)
IC50 1900±n/a nM
Citation Wang, YJiao, XKayser, FLiu, JWang, ZWanska, MGreenberg, JWeiszmann, JGe, HTian, HWong, SSchwandner, RLee, TLi, Y The first synthetic agonists of FFA2: Discovery and SAR of phenylacetamides as allosteric modulators. Bioorg Med Chem Lett20:493-8 (2010) 
 
Free fatty acid receptor 2
Name:Free fatty acid receptor 2
Type:PROTEIN
Mol. Mass.:37156.44
Organism:Homo sapiens (Human)
Description:ChEMBL_1508993
Residue:330
BDBM50305957
NameBDBM50305957
Synonyms:(S)-2-(4-chlorophenyl)-3-methyl-N-(5-(trifluoromethyl)-1,3,4-thiadiazol-2-yl)butanamide | CHEMBL594770
TypeSmall organic molecule
Emp. Form.C14H13ClF3N3OS
Mol. Mass.363.786
SMILESCC(C)[C@H](C(=O)Nc1nnc(s1)C(F)(F)F)c1ccc(Cl)cc1