Reaction Details
TargetFree fatty acid receptor 2
LigandBDBM50305974
Substrate/Competitorn/a
Meas. Tech.ChEMBL_605612 (CHEMBL1069216)
IC50 700±n/a nM
Citation Wang, YJiao, XKayser, FLiu, JWang, ZWanska, MGreenberg, JWeiszmann, JGe, HTian, HWong, SSchwandner, RLee, TLi, Y The first synthetic agonists of FFA2: Discovery and SAR of phenylacetamides as allosteric modulators. Bioorg Med Chem Lett20:493-8 (2010) 
 
Free fatty acid receptor 2
Name:Free fatty acid receptor 2
Type:PROTEIN
Mol. Mass.:37156.44
Organism:Homo sapiens (Human)
Description:ChEMBL_1508993
Residue:330
BDBM50305974
NameBDBM50305974
Synonyms:(S)-2-(4-chlorophenyl)-3-methyl-N-(thiazol-2-yl)butanamide | CHEMBL594671
TypeSmall organic molecule
Emp. Form.C14H15ClN2OS
Mol. Mass.294.8
SMILESCC(C)[C@H](C(=O)Nc1nccs1)c1ccc(Cl)cc1