Reaction Details
TargetCannabinoid receptor 1
LigandBDBM50305988
Substrate/Competitorn/a
Meas. Tech.ChEMBL_605658 (CHEMBL1071186)
IC50 5.3±n/a nM
Citation Boström, JOlsson, RITholander, JGreasley, PJRyberg, ENordberg, HHjorth, SCheng, L Novel thioamide derivatives as neutral CB1 receptor antagonists. Bioorg Med Chem Lett20:479-82 (2010) 
 
Cannabinoid receptor 1
Name:Cannabinoid receptor 1
Type:G Protein-Coupled Receptor (GPCR)
Mol. Mass.:52868.96
Organism:Homo sapiens (Human)
Description:P21554
Residue:472
BDBM50305988
NameBDBM50305988
Synonyms:5,6-bis(4-chlorophenyl)-N-(4,4-difluorocyclohexyl)pyrazine-2-carboxamide | CHEMBL606757
TypeSmall organic molecule
Emp. Form.C23H19Cl2F2N3O
Mol. Mass.462.319
SMILESFC1(F)CCC(CC1)NC(=O)c1cnc(-c2ccc(Cl)cc2)c(n1)-c1ccc(Cl)cc1