Reaction Details
TargetCytochrome P450 2C9
LigandBDBM50305995
Substrate/Competitorn/a
Meas. Tech.ChEMBL_605685 (CHEMBL1071215)
IC50 7000±n/a nM
Citation Gilbert, EJZhou, GWong, MKTong, LShankar, BBHuang, CKelly, JLavey, BJMcCombie, SWChen, LRizvi, RDong, YShu, YKozlowski, JAShih, NYHipkin, RWGonsiorek, WMalikzay, ALunn, CAFavreau, LLundell, DJ Non-aromatic A-ring replacement in the triaryl bis-sulfone CB2 receptor inhibitors. Bioorg Med Chem Lett20:608-11 (2010) 
 
Cytochrome P450 2C9
Name:Cytochrome P450 2C9
Type:Enzyme
Mol. Mass.:55636.33
Organism:Homo sapiens (Human)
Description:P11712
Residue:490
BDBM50305995
NameBDBM50305995
Synonyms:CHEMBL593596 | N-((1-(4-chloro-2-(2-fluorophenylsulfonyl)phenylsulfonyl)-4-fluoropiperidin-4-yl)methyl)-1,1,1-trifluoromethanesulfonamide
TypeSmall organic molecule
Emp. Form.C19H18ClF5N2O6S3
Mol. Mass.596.996
SMILESFc1ccccc1S(=O)(=O)c1cc(Cl)ccc1S(=O)(=O)N1CCC(F)(CNS(=O)(=O)C(F)(F)F)CC1