Reaction Details
TargetCytochrome P450 2C9
LigandBDBM50305997
Substrate/Competitorn/a
Meas. Tech.ChEMBL_605685 (CHEMBL1071215)
IC50 13000±n/a nM
Citation Gilbert, EJZhou, GWong, MKTong, LShankar, BBHuang, CKelly, JLavey, BJMcCombie, SWChen, LRizvi, RDong, YShu, YKozlowski, JAShih, NYHipkin, RWGonsiorek, WMalikzay, ALunn, CAFavreau, LLundell, DJ Non-aromatic A-ring replacement in the triaryl bis-sulfone CB2 receptor inhibitors. Bioorg Med Chem Lett20:608-11 (2010) 
 
Cytochrome P450 2C9
Name:Cytochrome P450 2C9
Type:Enzyme
Mol. Mass.:55636.33
Organism:Homo sapiens (Human)
Description:P11712
Residue:490
BDBM50305997
NameBDBM50305997
Synonyms:CHEMBL593823 | allyl(1-(4-chloro-2-(2-fluorophenylsulfonyl)phenylsulfonyl)-4-((trifluoromethylsulfonamido)methyl)piperidin-4-yl)methylcarbamate
TypeSmall organic molecule
Emp. Form.C24H26ClF4N3O8S3
Mol. Mass.692.12
SMILESFc1ccccc1S(=O)(=O)c1cc(Cl)ccc1S(=O)(=O)N1CCC(CNC(=O)OCC=C)(CNS(=O)(=O)C(F)(F)F)CC1